Reaction Details
TargetATP-sensitive inward rectifier potassium channel 1
LigandBDBM181726
Substrate/Competitorn/a
Meas. Tech.Electrophysiology Assay
pH7.4±n/a
Temperature310.15±n/a K
IC50 45±n/a nM
Commentsextracted
Citation Walsh, SPPasternak, ADeJesus, RKTang, HPio, BShahripour, ABelyk, KMChobanian, HRGuo, YFrie, JLShi, ZChen, HBlizzard, TACato, B Inhibitors of the Renal Outer Medullary Potassium channel US Patent US9139585 Publication Date 9/22/2015
 
ATP-sensitive inward rectifier potassium channel 1
Name:ATP-sensitive inward rectifier potassium channel 1
Type:Enzyme Catalytic Domain
Mol. Mass.:44809.08
Organism:Homo sapiens (Human)
Description:gi_223460826
Residue:391
BDBM181726
NameBDBM181726
Synonyms:US9139585, 21
TypeSmall organic molecule
Emp. Form.C29H34N2O6
Mol. Mass.506.5901
SMILESC[C@@H]1Cc2cc(CCN3CC4COCC(C3)N4C[C@H](O)c3ccc4C(=O)OCc4c3C)ccc2C(=O)O1