Reaction Details
TargetATP-sensitive inward rectifier potassium channel 1
LigandBDBM181758
Substrate/Competitorn/a
Meas. Tech.Electrophysiology Assay
pH7.4±n/a
Temperature310.15±n/a K
IC50 14±n/a nM
Commentsextracted
Citation Walsh, SPPasternak, ADeJesus, RKTang, HPio, BShahripour, ABelyk, KMChobanian, HRGuo, YFrie, JLShi, ZChen, HBlizzard, TACato, B Inhibitors of the Renal Outer Medullary Potassium channel US Patent US9139585 Publication Date 9/22/2015
 
ATP-sensitive inward rectifier potassium channel 1
Name:ATP-sensitive inward rectifier potassium channel 1
Type:Enzyme Catalytic Domain
Mol. Mass.:44809.08
Organism:Homo sapiens (Human)
Description:gi_223460826
Residue:391
BDBM181758
NameBDBM181758
Synonyms:US9139585, 34B
TypeSmall organic molecule
Emp. Form.C23H27N7O4
Mol. Mass.465.505
SMILESCc1c2COC(=O)c2ccc1[C@@H](O)CN1CCN(C[C@@H](O)c2ccc(nc2)-n2cnnn2)CC1