Reaction Details
TargetATP-sensitive inward rectifier potassium channel 1
LigandBDBM181748
Substrate/Competitorn/a
Meas. Tech.Electrophysiology Assay
pH7.4±n/a
Temperature310.15±n/a K
IC50 17.5±n/a nM
Commentsextracted
Citation Walsh, SPPasternak, ADeJesus, RKTang, HPio, BShahripour, ABelyk, KMChobanian, HRGuo, YFrie, JLShi, ZChen, HBlizzard, TACato, B Inhibitors of the Renal Outer Medullary Potassium channel US Patent US9139585 Publication Date 9/22/2015
 
ATP-sensitive inward rectifier potassium channel 1
Name:ATP-sensitive inward rectifier potassium channel 1
Type:Enzyme Catalytic Domain
Mol. Mass.:44809.08
Organism:Homo sapiens (Human)
Description:gi_223460826
Residue:391
BDBM181748
NameBDBM181748
Synonyms:US9139585, 38A
TypeSmall organic molecule
Emp. Form.C27H32N2O6
Mol. Mass.480.5528
SMILESC[C@@H]1Cc2cc(ccc2C(=O)O1)[C@@H](O)CN1CCN(C[C@H](O)c2ccc3C(=O)OCc3c2C)CC1