Reaction Details
TargetRibosomal protein S6 kinase beta-1
LigandBDBM182409
Substrate/Competitorn/a
Meas. Tech.P70S6K Enzyme Assay
pH7.5±n/a
Temperature298.15±n/a K
IC50 0.7±n/a nM
Commentsextracted
Citation Lan, RHuck, BRXiao, YChen, XDeselm, LCQiu, HNeagu, CBankston, DJones, CC Imidazole amines as modulators of kinase activity US Patent US9145392 Publication Date 9/29/2015
 
Ribosomal protein S6 kinase beta-1
Name:Ribosomal protein S6 kinase beta-1
Type:Enzyme
Mol. Mass.:59139.89
Organism:Homo sapiens (Human)
Description:His-tagged S6K1.
Residue:525
BDBM182409
NameBDBM182409
Synonyms:US9145392, 110
TypeSmall organic molecule
Emp. Form.C28H30F4N8
Mol. Mass.554.585
SMILESNc1ncnc(N2CCC(CC2)c2nc(cn2CCN2CCC2)-c2ccc(F)c(c2)C(F)(F)F)c1-c1cc[nH]c1