Reaction Details
TargetRibosomal protein S6 kinase beta-1
LigandBDBM182425
Substrate/Competitorn/a
Meas. Tech.P70S6K Enzyme Assay
pH7.5±n/a
Temperature298.15±n/a K
IC50 0.5±n/a nM
Commentsextracted
Citation Lan, RHuck, BRXiao, YChen, XDeselm, LCQiu, HNeagu, CBankston, DJones, CC Imidazole amines as modulators of kinase activity US Patent US9145392 Publication Date 9/29/2015
 
Ribosomal protein S6 kinase beta-1
Name:Ribosomal protein S6 kinase beta-1
Type:Enzyme
Mol. Mass.:59139.89
Organism:Homo sapiens (Human)
Description:His-tagged S6K1.
Residue:525
BDBM182425
NameBDBM182425
Synonyms:US9145392, 126
TypeSmall organic molecule
Emp. Form.C23H26BrF3N8
Mol. Mass.551.405
SMILESNc1ncnc(N2CCC(CC2)c2nc(cn2CCN2CCC2)-c2ccnc(c2)C(F)(F)F)c1Br