Reaction Details
TargetRibosomal protein S6 kinase beta-1
LigandBDBM182656
Substrate/Competitorn/a
Meas. Tech.P70S6K Enzyme Assay
pH7.5±n/a
Temperature298.15±n/a K
IC50 0.8±n/a nM
Commentsextracted
Citation Lan, RHuck, BRXiao, YChen, XDeselm, LCQiu, HNeagu, CBankston, DJones, CC Imidazole amines as modulators of kinase activity US Patent US9145392 Publication Date 9/29/2015
 
Ribosomal protein S6 kinase beta-1
Name:Ribosomal protein S6 kinase beta-1
Type:Enzyme
Mol. Mass.:59139.89
Organism:Homo sapiens (Human)
Description:His-tagged S6K1.
Residue:525
BDBM182656
NameBDBM182656
Synonyms:US9145392, 357
TypeSmall organic molecule
Emp. Form.C22H21F4N7O
Mol. Mass.475.4421
SMILESNc1ncnc(N2CCC(CC2)c2nc(cn2CCO)-c2ccc(F)c(c2)C(F)(F)F)c1C#N