Reaction Details
TargetRibosomal protein S6 kinase beta-1
LigandBDBM182669
Substrate/Competitorn/a
Meas. Tech.P70S6K Enzyme Assay
pH7.5±n/a
Temperature298.15±n/a K
IC50 0.9±n/a nM
Commentsextracted
Citation Lan, RHuck, BRXiao, YChen, XDeselm, LCQiu, HNeagu, CBankston, DJones, CC Imidazole amines as modulators of kinase activity US Patent US9145392 Publication Date 9/29/2015
 
Ribosomal protein S6 kinase beta-1
Name:Ribosomal protein S6 kinase beta-1
Type:Enzyme
Mol. Mass.:59139.89
Organism:Homo sapiens (Human)
Description:His-tagged S6K1.
Residue:525
BDBM182669
NameBDBM182669
Synonyms:US9145392, 370
TypeSmall organic molecule
Emp. Form.C25H30F4N8O
Mol. Mass.534.5523
SMILESCC(C)NCCn1cc(nc1C1CCN(CC1)c1ncnc(N)c1C(N)=O)-c1ccc(F)c(c1)C(F)(F)F