Reaction Details
TargetRibosomal protein S6 kinase beta-1
LigandBDBM182671
Substrate/Competitorn/a
Meas. Tech.P70S6K Enzyme Assay
pH7.5±n/a
Temperature298.15±n/a K
IC50 0.2±n/a nM
Commentsextracted
Citation Lan, RHuck, BRXiao, YChen, XDeselm, LCQiu, HNeagu, CBankston, DJones, CC Imidazole amines as modulators of kinase activity US Patent US9145392 Publication Date 9/29/2015
 
Ribosomal protein S6 kinase beta-1
Name:Ribosomal protein S6 kinase beta-1
Type:Enzyme
Mol. Mass.:59139.89
Organism:Homo sapiens (Human)
Description:His-tagged S6K1.
Residue:525
BDBM182671
NameBDBM182671
Synonyms:US9145392, 372
TypeSmall organic molecule
Emp. Form.C26H30F4N8
Mol. Mass.530.5636
SMILESCC(C)CNCCn1cc(nc1C1CCN(CC1)c1ncnc(N)c1C#N)-c1ccc(F)c(c1)C(F)(F)F