Reaction Details
TargetRAC-alpha serine/threonine-protein kinase
LigandBDBM182624
Substrate/Competitorn/a
Meas. Tech.AKT Enzyme Assay
pH7.5±n/a
IC50 0.9±n/a nM
Commentsextracted
Citation Lan, RHuck, BRXiao, YChen, XDeselm, LCQiu, HNeagu, CBankston, DJones, CC Imidazole amines as modulators of kinase activity US Patent US9145392 Publication Date 9/29/2015
 
RAC-alpha serine/threonine-protein kinase
Name:RAC-alpha serine/threonine-protein kinase
Type:Enzyme
Mol. Mass.:55681.25
Organism:Homo sapiens (Human)
Description:P31749
Residue:480
BDBM182624
NameBDBM182624
Synonyms:US9145392, 325
TypeSmall organic molecule
Emp. Form.C24H29FN8
Mol. Mass.448.5391
SMILESCN(C)CCn1cc(nc1C1CCN(CC1)c1ncnc(N)c1C#N)-c1ccc(F)c(C)c1