Reaction Details
TargetRAC-alpha serine/threonine-protein kinase
LigandBDBM182671
Substrate/Competitorn/a
Meas. Tech.AKT Enzyme Assay
pH7.5±n/a
IC50 0.7±n/a nM
Commentsextracted
Citation Lan, RHuck, BRXiao, YChen, XDeselm, LCQiu, HNeagu, CBankston, DJones, CC Imidazole amines as modulators of kinase activity US Patent US9145392 Publication Date 9/29/2015
 
RAC-alpha serine/threonine-protein kinase
Name:RAC-alpha serine/threonine-protein kinase
Type:Enzyme
Mol. Mass.:55681.25
Organism:Homo sapiens (Human)
Description:P31749
Residue:480
BDBM182671
NameBDBM182671
Synonyms:US9145392, 372
TypeSmall organic molecule
Emp. Form.C26H30F4N8
Mol. Mass.530.5636
SMILESCC(C)CNCCn1cc(nc1C1CCN(CC1)c1ncnc(N)c1C#N)-c1ccc(F)c(c1)C(F)(F)F