Reaction Details
TargetLeucine-rich repeat serine/threonine-protein kinase 2
LigandBDBM182728
Substrate/Competitorn/a
Meas. Tech.In vitro LRRK2 Lanthascreen Binding Assay
Ki 3±n/a nM
Citation Baker-Glenn, CChambers, MChan, BKEstrada, AShore, DSweeney, ZKChen, H Aminopyrimidine derivatives as LRRK2 modulators US Patent US9145402 Publication Date 9/29/2015
 
Leucine-rich repeat serine/threonine-protein kinase 2
Name:Leucine-rich repeat serine/threonine-protein kinase 2
Type:Protein
Mol. Mass.:286113.20
Organism:Homo sapiens (Human)
Description:Q5S007
Residue:2527
BDBM182728
NameBDBM182728
Synonyms:US9145402, 35
TypeSmall organic molecule
Emp. Form.C16H19F3N4O3S
Mol. Mass.404.407
SMILESCCS(=O)(=O)c1cc(OC)c(Nc2ncc(c(NC)n2)C(F)(F)F)cc1C