Reaction Details
TargetFerrochelatase, mitochondrial [R115L]
LigandBDBM50311017
Substrate/Competitorn/a
Meas. Tech.Competition Binding Assays
Kd 3.4e+3±n/a nM
Citation Klaeger, SGohlke, BPerrin, JGupta, VHeinzlmeir, SHelm, DQiao, HBergamini, GHanda, HSavitski, MMBantscheff, MMédard, GPreissner, RKuster, B Chemical Proteomics Reveals Ferrochelatase as a Common Off-target of Kinase Inhibitors. ACS Chem Biol11:1245-54 (2016) 
 
Ferrochelatase, mitochondrial [R115L]
Name:Ferrochelatase, mitochondrial [R115L]
Type:Protein
Mol. Mass.:47832.73
Organism:Homo sapiens (Human)
Description:Mutant R115L used for experiment
Residue:423
BDBM50311017
NameBDBM50311017
Synonyms:CHEMBL1078178 N-(cyanomethyl)-4-(2-(4-morpholinophenylamino)pyrimidin-4-yl)benzamide US10766894, Compound TABLE 1.4 US9469613, CYT-0387
TypeSmall organic molecule
Emp. Form.C23H22N6O2
Mol. Mass.414.4598
SMILESO=C(NCC#N)c1ccc(cc1)-c1ccnc(Nc2ccc(cc2)N2CCOCC2)n1