Reaction Details
TargetCoagulation factor XIII A chain [Q652E]
LigandBDBM185181
Substrate/Competitorn/a
Meas. Tech.TG Activity Assays
IC50>1.00e+5±n/a nM
Citation Badarau, EWang, ZRathbone, DLCostanzi, AThibault, TMurdoch, CEEl Alaoui, SBartkeviciute, MGriffin, M Development of Potent and Selective Tissue Transglutaminase Inhibitors: Their Effect on TG2 Function and Application in Pathological Conditions. Chem Biol22:1347-61 (2015) 
 
Coagulation factor XIII A chain [Q652E]
Name:Coagulation factor XIII A chain [Q652E]
Type:Protein
Mol. Mass.:83261.26
Organism:Homo sapiens (Human)
Description:P00488[Q652E]
Residue:732
BDBM185181
NameBDBM185181
Synonyms:N-[2-[4-[[5-(dimethylamino)-1-naphthyl]sulfonyl]piperazin-1-yl]-2-oxo-ethyl]prop-2-enamide (3h)
TypeSmall organic molecule
Emp. Form.C21H26N4O4S
Mol. Mass.430.521
SMILESCN(C)c1cccc2c(cccc12)S(=O)(=O)N1CCN(CC1)C(=O)CNC(=O)C=C