Reaction Details
TargetProtein-glutamine gamma-glutamyltransferase K
LigandBDBM185163
Substrate/Competitorn/a
Meas. Tech.TG Activity Assays
IC50 5e+3±n/a nM
Citation Badarau, EWang, ZRathbone, DLCostanzi, AThibault, TMurdoch, CEEl Alaoui, SBartkeviciute, MGriffin, M Development of Potent and Selective Tissue Transglutaminase Inhibitors: Their Effect on TG2 Function and Application in Pathological Conditions. Chem Biol22:1347-61 (2015) 
 
Protein-glutamine gamma-glutamyltransferase K
Name:Protein-glutamine gamma-glutamyltransferase K
Type:Protein
Mol. Mass.:89778.63
Organism:Homo sapiens (Human)
Description:n/a
Residue:817
BDBM185163
NameBDBM185163
Synonyms:(6-Methoxycarbonyl-2-naphthyl)methyl 4-[2-[(2-bromoacetyl)amino]acetyl]piperazine-1-carboxylate (6d)
TypeSmall organic molecule
Emp. Form.C22H24BrN3O6
Mol. Mass.506.346
SMILESCOC(=O)c1ccc2cc(COC(=O)N3CCN(CC3)C(=O)CNC(=O)CBr)ccc2c1