Reaction Details
TargetCoagulation factor XIII A chain [Q652E]
LigandBDBM185155
Substrate/Competitorn/a
Meas. Tech.TG Activity Assays
IC50>1.00e+5±n/a nM
Citation Badarau, EWang, ZRathbone, DLCostanzi, AThibault, TMurdoch, CEEl Alaoui, SBartkeviciute, MGriffin, M Development of Potent and Selective Tissue Transglutaminase Inhibitors: Their Effect on TG2 Function and Application in Pathological Conditions. Chem Biol22:1347-61 (2015) 
 
Coagulation factor XIII A chain [Q652E]
Name:Coagulation factor XIII A chain [Q652E]
Type:Protein
Mol. Mass.:83261.26
Organism:Homo sapiens (Human)
Description:P00488[Q652E]
Residue:732
BDBM185155
NameBDBM185155
Synonyms:[2-[[2-(4-Benzyloxycarbonylpiperazin-1-yl)-2-oxo-ethyl]amino]-2-oxo-ethyl]-dimethylsulfonium bromide (1a)
TypeSmall organic molecule
Emp. Form.C18H26N3O4S
Mol. Mass.380.481
SMILESC[S+](C)CC(=O)NCC(=O)N1CCN(CC1)C(=O)OCc1ccccc1