Reaction Details
TargetCoagulation factor XIII A chain [Q652E]
LigandBDBM185164
Substrate/Competitorn/a
Meas. Tech.TG Activity Assays
IC50>1.00e+5±n/a nM
Citation Badarau, EWang, ZRathbone, DLCostanzi, AThibault, TMurdoch, CEEl Alaoui, SBartkeviciute, MGriffin, M Development of Potent and Selective Tissue Transglutaminase Inhibitors: Their Effect on TG2 Function and Application in Pathological Conditions. Chem Biol22:1347-61 (2015) 
 
Coagulation factor XIII A chain [Q652E]
Name:Coagulation factor XIII A chain [Q652E]
Type:Protein
Mol. Mass.:83261.26
Organism:Homo sapiens (Human)
Description:P00488[Q652E]
Residue:732
BDBM185164
NameBDBM185164
Synonyms:(6-Methoxycarbonyl-2-naphthyl)methyl 4-[2-(prop-2-enoylamino)acetyl]piperazine-1-carboxylate (3d)
TypeSmall organic molecule
Emp. Form.C24H30N3O6S
Mol. Mass.488.576
SMILESCOC(=O)c1ccc2cc(COC(=O)N3CCN(CC3)C(=O)CNC(=O)C[S+](C)C)ccc2c1