Reaction Details
TargetD(2) dopamine receptor
LigandBDBM50395574
Substrate/Competitorn/a
Meas. Tech.Radioligand Binding Assay
pH7.4±n/a
Ki 18±2 nM
Commentsextracted
Citation Jin, JRoth, BFrye, S Functionally selective ligands of dopamine D2 receptors US Patent US9156822 Publication Date 10/13/2015
 
D(2) dopamine receptor
Name:D(2) dopamine receptor
Type:Cell-surface receptors
Mol. Mass.:50647.10
Organism:Homo sapiens (Human)
Description:P14416
Residue:443
BDBM50395574
NameBDBM50395574
Synonyms:CHEMBL2165114 US9156822, 7
TypeSmall organic molecule
Emp. Form.C22H25Cl2N3OS
Mol. Mass.450.424
SMILESClc1cccc(N2CCCN(CCCCOc3ccc4scnc4c3)CC2)c1Cl