Reaction Details
TargetD(2) dopamine receptor
LigandBDBM185684
Substrate/Competitorn/a
Meas. Tech.Radioligand Binding Assay
pH7.4±n/a
Ki 3.6±0.2 nM
Commentsextracted
Citation Jin, JRoth, BFrye, S Functionally selective ligands of dopamine D2 receptors US Patent US9156822 Publication Date 10/13/2015
 
D(2) dopamine receptor
Name:D(2) dopamine receptor
Type:Cell-surface receptors
Mol. Mass.:50647.10
Organism:Homo sapiens (Human)
Description:P14416
Residue:443
BDBM185684
NameBDBM185684
Synonyms:UNC10107962 | US9156822, 14
TypeSmall organic molecule
Emp. Form.C26H33N3O3
Mol. Mass.435.5585
SMILESCCOc1ccccc1N1CCCN(CCCCOc2ccc3ccc(=O)[nH]c3c2)CC1