Reaction Details
TargetD(2) dopamine receptor
LigandBDBM50395578
Substrate/Competitorn/a
Meas. Tech.Radioligand Binding Assay
pH7.4±n/a
Ki 42±4 nM
Commentsextracted
Citation Jin, JRoth, BFrye, S Functionally selective ligands of dopamine D2 receptors US Patent US9156822 Publication Date 10/13/2015
 
D(2) dopamine receptor
Name:D(2) dopamine receptor
Type:Cell-surface receptors
Mol. Mass.:50647.10
Organism:Homo sapiens (Human)
Description:P14416
Residue:443
BDBM50395578
NameBDBM50395578
Synonyms:CHEMBL2165137 US9156822, 21
TypeSmall organic molecule
Emp. Form.C22H24Cl2N2OS
Mol. Mass.435.41
SMILESClc1cccc(C2CCN(CCCCOc3ccc4scnc4c3)CC2)c1Cl