Reaction Details
TargetD(2) dopamine receptor
LigandBDBM185694
Substrate/Competitorn/a
Meas. Tech.Radioligand Binding Assay
pH7.4±n/a
Ki 1.7±0.1 nM
Commentsextracted
Citation Jin, JRoth, BFrye, S Functionally selective ligands of dopamine D2 receptors US Patent US9156822 Publication Date 10/13/2015
 
D(2) dopamine receptor
Name:D(2) dopamine receptor
Type:Cell-surface receptors
Mol. Mass.:50647.10
Organism:Homo sapiens (Human)
Description:P14416
Residue:443
BDBM185694
NameBDBM185694
Synonyms:UNC10107957 | US9156822, 37
TypeSmall organic molecule
Emp. Form.C23H30N4O3
Mol. Mass.410.5093
SMILESCOc1ccccc1N1CCN(CCCCOc2ccc3CCC(=O)Nc3n2)CC1