Reaction Details
TargetD(2) dopamine receptor
LigandBDBM50349866
Substrate/Competitorn/a
Meas. Tech.Beta-Arrestin Recruitment (Tango) Assay
pH7.4±n/a
EC50 0.5±n/a nM
Commentsextracted
Citation Jin, JRoth, BFrye, S Functionally selective ligands of dopamine D2 receptors US Patent US9156822 Publication Date 10/13/2015
 
D(2) dopamine receptor
Name:D(2) dopamine receptor
Type:Cell-surface receptors
Mol. Mass.:50647.10
Organism:Homo sapiens (Human)
Description:P14416
Residue:443
BDBM50349866
NameBDBM50349866
Synonyms:CHEMBL160296 UNC10108016 | US9156822, 39
TypeSmall organic molecule
Emp. Form.C24H31N3O3
Mol. Mass.409.5212
SMILESCOc1ccccc1N1CCN(CCCCOc2ccc3CCC(=O)Nc3c2)CC1