Reaction Details
TargetPoly [ADP-ribose] polymerase tankyrase-2
LigandBDBM185805
Substrate/Competitorn/a
Meas. Tech.Biochemical Assay
Temperature298.15±n/a K
IC50 3±1 nM
Commentsextracted
Citation Chen, CHChin, DNDiPietro, LVFan, JPalermo, MGShultz, MDToure, B 4-piperidinyl compounds for use as tankyrase inhibitors US Patent US9163003 Publication Date 10/20/2015
 
Poly [ADP-ribose] polymerase tankyrase-2
Name:Poly [ADP-ribose] polymerase tankyrase-2
Type:Enzyme
Mol. Mass.:126937.16
Organism:Homo sapiens (Human)
Description:Q9H2K2
Residue:1166
BDBM185805
NameBDBM185805
Synonyms:US9163003, 13 | USRE46942, Example 13
TypeSmall organic molecule
Emp. Form.C26H32N4O5
Mol. Mass.480.5561
SMILESCOc1ccc(cc1C)C(=O)C1CCN(CC1)[C@H]1CCN(Cc2nc3CCOCc3c(=O)[nH]2)C1=O