Reaction Details
TargetVoltage-dependent calcium channel gamma-8 subunit
LigandBDBM288237
Substrate/Competitorn/a
Meas. Tech.Calcium Flux Assay
pH7.4±n/a
IC50 0.040±n/a nM
Commentsextracted
Citation Ameriks, MKGyuris, MLaforteza, BNLebold, TPMeyer, STRavula, SSavall, BMShireman, BTWade, WSGerencsér, J Fused bicylic pyridine compounds and their use as AMPA receptor modulators US Patent US10087185 Publication Date 10/2/2018
 
Voltage-dependent calcium channel gamma-8 subunit
Name:Voltage-dependent calcium channel gamma-8 subunit
Type:Enzyme Catalytic Domain
Mol. Mass.:43326.96
Organism:Homo sapiens (Human)
Description:Q8WXS5
Residue:425
BDBM288237
NameBDBM288237
Synonyms:6-(4-Fluorophenyl)-5-(7-methyl-1H-indazol-5-yl)-2- | US10087185, Example 55
TypeSmall organic molecule
Emp. Form.C21H13F4N5
Mol. Mass.411.355
SMILESCc1cc(cc2cn[nH]c12)-c1c(ccc2nc(nn12)C(F)(F)F)-c1ccc(F)cc1