Reaction Details
TargetVoltage-dependent calcium channel gamma-8 subunit
LigandBDBM288252
Substrate/Competitorn/a
Meas. Tech.Calcium Flux Assay
pH7.4±n/a
IC50 0.063±n/a nM
Commentsextracted
Citation Ameriks, MKGyuris, MLaforteza, BNLebold, TPMeyer, STRavula, SSavall, BMShireman, BTWade, WSGerencsér, J Fused bicylic pyridine compounds and their use as AMPA receptor modulators US Patent US10087185 Publication Date 10/2/2018
 
Voltage-dependent calcium channel gamma-8 subunit
Name:Voltage-dependent calcium channel gamma-8 subunit
Type:Enzyme Catalytic Domain
Mol. Mass.:43326.96
Organism:Homo sapiens (Human)
Description:Q8WXS5
Residue:425
BDBM288252
NameBDBM288252
Synonyms:7-Chloro-5-(2-cyclopropyl-6-(trifluoromethyl)pyrazolo[1,5-a]pyridin- US10087185, Example 70
TypeSmall organic molecule
Emp. Form.C18H12ClF3N4
Mol. Mass.376.763
SMILESFC(F)(F)c1ccc2cc(nn2c1-c1cc(Cl)c2[nH]ncc2c1)C1CC1