Reaction Details
TargetVoltage-dependent calcium channel gamma-8 subunit
LigandBDBM288253
Substrate/Competitorn/a
Meas. Tech.Calcium Flux Assay
pH7.4±n/a
IC50 0.016±n/a nM
Commentsextracted
Citation Ameriks, MKGyuris, MLaforteza, BNLebold, TPMeyer, STRavula, SSavall, BMShireman, BTWade, WSGerencsér, J Fused bicylic pyridine compounds and their use as AMPA receptor modulators US Patent US10087185 Publication Date 10/2/2018
 
Voltage-dependent calcium channel gamma-8 subunit
Name:Voltage-dependent calcium channel gamma-8 subunit
Type:Enzyme Catalytic Domain
Mol. Mass.:43326.96
Organism:Homo sapiens (Human)
Description:Q8WXS5
Residue:425
BDBM288253
NameBDBM288253
Synonyms:5-(2-Isopropyl-6-(trifluoromethyl)pyrazolo[1,5-a]pyridin-7-yl)-7- | US10087185, Example 71
TypeSmall organic molecule
Emp. Form.C20H18F3N3O
Mol. Mass.373.3716
SMILESCC(C)c1cc2ccc(c(-c3cc4CC(=O)Nc4c(C)c3)n2n1)C(F)(F)F