Reaction Details
TargetVoltage-dependent calcium channel gamma-8 subunit
LigandBDBM288307
Substrate/Competitorn/a
Meas. Tech.Calcium Flux Assay
pH7.4±n/a
IC50 0.100±n/a nM
Commentsextracted
Citation Ameriks, MKGyuris, MLaforteza, BNLebold, TPMeyer, STRavula, SSavall, BMShireman, BTWade, WSGerencsér, J Fused bicylic pyridine compounds and their use as AMPA receptor modulators US Patent US10087185 Publication Date 10/2/2018
 
Voltage-dependent calcium channel gamma-8 subunit
Name:Voltage-dependent calcium channel gamma-8 subunit
Type:Enzyme Catalytic Domain
Mol. Mass.:43326.96
Organism:Homo sapiens (Human)
Description:Q8WXS5
Residue:425
BDBM288307
NameBDBM288307
Synonyms:7-(7-Chloro-1H-indazol-5-yl)-6-(difluoromethyl)-4-methyl-2- | US10087185, Example 125
TypeSmall organic molecule
Emp. Form.C17H10ClF5N4
Mol. Mass.400.733
SMILESCc1cc(C(F)F)c(-c2cc(Cl)c3[nH]ncc3c2)n2nc(cc12)C(F)(F)F