Reaction Details
TargetGlycogen synthase kinase-3 alpha
LigandBDBM60933
Substrate/Competitorn/a
Meas. Tech.Mobility Shift Microfluidics Assay
pH7.5±n/a
Temperature298.15±n/a K
IC50 8± 3 nM
Commentsextracted
Citation Wagner, FFBishop, JAGale, JPShi, XWalk, MKetterman, JPatnaik, DBarker, DWalpita, DCampbell, AJNguyen, SLewis, MRoss, LWeïwer, MAn, WFGermain, ARNag, PPMetkar, SKaya, TDandapani, SOlson, DEBarbe, ALLazzaro, FSacher, JRCheah, JHFei, DPerez, JMunoz, BPalmer, MStegmaier, KSchreiber, SLScolnick, EZhang, YLHaggarty, SJHolson, EBPan, JQ Inhibitors of Glycogen Synthase Kinase 3 with Exquisite Kinome-Wide Selectivity and Their Functional Effects. ACS Chem Biol11:1952-63 (2016) 
 
Glycogen synthase kinase-3 alpha
Name:Glycogen synthase kinase-3 alpha
Type:Enzyme
Mol. Mass.:50991.79
Organism:Homo sapiens (Human)
Description:P49840
Residue:483
BDBM60933
NameBDBM60933
Synonyms:(S)-3,4,7,7-tetramethyl-4-phenyl-2,4,6,7,8,9-hexahydro-5H-pyrazolo[3,4-b]quinolin-5-one (16) | US10137122, Compound 123
Typen/a
Emp. Form.C20H23N3O
Mol. Mass.321.4161
SMILESCc1[nH]nc2NC3=C(C(=O)CC(C)(C)C3)[C@](C)(c12)c1ccccc1