Reaction Details
TargetCytochrome P450 3A5
LigandBDBM151585
Substrate/Competitorn/a
Meas. Tech.Fluorescent High Throughput P450 Assay
IC50 120±100 nM
Citation Maj, RPattarino, FMura, EBarberis, A Phospholipid drug analogs US Patent US9173935 Publication Date 11/3/2015
 
Cytochrome P450 3A5
Name:Cytochrome P450 3A5
Type:Protein
Mol. Mass.:57118.00
Organism:Homo sapiens (Human)
Description:P20815
Residue:502
BDBM151585
NameBDBM151585
Synonyms:US11739089, Compound Ketoconazole US9180183, Ketoconazole US9394290, KTZ (ketoconazole) | US9963439, Ketoconazole
TypeSmall organic molecule
Emp. Form.C26H28Cl2N4O4
Mol. Mass.531.431
SMILESCC(=O)N1CCN(CC1)c1ccc(OCC2COC(Cn3ccnc3)(O2)c2ccc(Cl)cc2Cl)cc1