Reaction Details
TargetGag-Pol polyprotein
LigandBDBM189337
Substrate/Competitorn/a
Meas. Tech.RNase H (RH) Assay
pH7.8±n/a
Temperature310.15±n/a K
IC50 2.5e+4± 3e+3 nM
Commentsextracted
Citation Tintori, CCorona, AEsposito, FBrai, AGrandi, NCeresola, ERClementi, MCanducci, FTramontano, EBotta, M Inhibition of HIV-1 Reverse Transcriptase Dimerization by Small Molecules. Chembiochem17:683-8 (2016) 
 
Gag-Pol polyprotein
Name:Gag-Pol polyprotein
Type:Protein
Mol. Mass.:161820.05
Organism:Human immunodeficiency virus type 1 group M subtype B (isolate NY5) (HIV-1)
Description:P12497
Residue:1435
BDBM189337
NameBDBM189337
Synonyms:STOCK5S-18255 (2)
TypeSmall organic molecule
Emp. Form.C26H29N5O3
Mol. Mass.459.5402
SMILESCCCCCn1c(=O)n(C)c2nc3N(CCCn3c2c1=O)c1ccc(Oc2ccccc2)cc1