Reaction Details
TargetProstaglandin E2 receptor EP4 subtype
LigandBDBM190282
Substrate/Competitorn/a
Meas. Tech.cAMP Assay
Temperature310.15±n/a K
EC50 0.079±n/a nM
Commentsextracted
Citation Barrett, SDCiske, FLColombo, JMEndres, GWGermain, BDKornilov, AKramer, JBUzieblo, AMaxey, KM Difluorolactam compounds as EP4 receptor-selective agonists for use in the treatment of EP4-mediated diseases and conditions US Patent US9180116 Publication Date 11/10/2015
 
Prostaglandin E2 receptor EP4 subtype
Name:Prostaglandin E2 receptor EP4 subtype
Type:Enzyme
Mol. Mass.:53134.53
Organism:Homo sapiens (Human)
Description:P35408
Residue:488
BDBM190282
NameBDBM190282
Synonyms:US9180116, 33C
TypeSmall organic molecule
Emp. Form.C20H27F2NO4S
Mol. Mass.415.494
SMILESCCCCC[C@H](O)\C=C\[C@H]1CC(F)(F)C(=O)N1CCCc1ccc(s1)C(O)=O