Reaction Details
TargetProstaglandin E2 receptor EP4 subtype
LigandBDBM190270
Substrate/Competitorn/a
Meas. Tech.SEAP Activity Assay
Temperature310.15±n/a K
EC50 0.059±n/a nM
Commentsextracted
Citation Barrett, SDCiske, FLColombo, JMEndres, GWGermain, BDKornilov, AKramer, JBUzieblo, AMaxey, KM Difluorolactam compounds as EP4 receptor-selective agonists for use in the treatment of EP4-mediated diseases and conditions US Patent US9180116 Publication Date 11/10/2015
 
Prostaglandin E2 receptor EP4 subtype
Name:Prostaglandin E2 receptor EP4 subtype
Type:Enzyme
Mol. Mass.:53134.53
Organism:Homo sapiens (Human)
Description:P35408
Residue:488
BDBM190270
NameBDBM190270
Synonyms:US9180116, 9C
TypeSmall organic molecule
Emp. Form.C19H31F2NO4
Mol. Mass.375.4505
SMILESCCCCC[C@H](O)\C=C\[C@H]1CC(F)(F)C(=O)N1CCCCCCC(O)=O