Reaction Details
TargetLysosomal alpha-glucosidase
LigandBDBM190533
Substrate/Competitorn/a
Meas. Tech.Enzyme Activity Assay
pH4±n/a
EC50 371800±43100 nM
Commentsextracted
Citation Mugrage, BLee, GZhu, XBoyd, RSheth, K Method for the treatment of pompe disease using 1-deoxynojirimycin and derivatives US Patent US9181184 Publication Date 11/10/2015
 
Lysosomal alpha-glucosidase
Name:Lysosomal alpha-glucosidase
Type:Enzyme
Mol. Mass.:106235.32
Organism:Mus musculus (Mouse)
Description:P70699
Residue:953
BDBM190533
NameBDBM190533
Synonyms:US9181184, 19
TypeSmall organic molecule
Emp. Form.C10H18F3NO5
Mol. Mass.289.2488
SMILESOC[C@@H]1[C@@H](O)[C@H](O)[C@@H](O)CN1CCOCC(F)(F)F