Reaction Details
TargetLysosomal alpha-glucosidase
LigandBDBM18364
Substrate/Competitorn/a
Meas. Tech.Enzyme Activity Assay
pH4±n/a
EC50 7000±1800 nM
Commentsextracted
Citation Mugrage, BLee, GZhu, XBoyd, RSheth, K Method for the treatment of pompe disease using 1-deoxynojirimycin and derivatives US Patent US9181184 Publication Date 11/10/2015
 
Lysosomal alpha-glucosidase
Name:Lysosomal alpha-glucosidase
Type:Enzyme
Mol. Mass.:106235.32
Organism:Mus musculus (Mouse)
Description:P70699
Residue:953
BDBM18364
NameBDBM18364
Synonyms:(2R,3R,4R,5S,6R)-2-(hydroxymethyl)-6-nonylpiperidine-3,4,5-triol US9181184, 32 | alpha-1-C-Nonyl-DNJ
TypeSmall organic molecule
Emp. Form.C15H31NO4
Mol. Mass.289.4109
SMILESCCCCCCCCC[C@H]1N[C@H](CO)[C@@H](O)[C@H](O)[C@H]1O