Reaction Details
TargetLysine-specific demethylase 5B [1-755]
LigandBDBM191603
Substrate/Competitorn/a
Meas. Tech.Formaldehyde Dehydrogenase-Coupled Demethylase (FDH) Assay
Temperature298.15±n/a K
IC50>1.00e+5±n/a nM
Commentsextracted
Citation Horton, JRLiu, XGale, MWu, LShanks, JRZhang, XWebber, PJBell, JSKales, SCMott, BTRai, GJansen, DJHenderson, MJUrban, DJHall, MDSimeonov, AMaloney, DJJohns, MAFu, HJadhav, AVertino, PMYan, QCheng, X Structural Basis for KDM5A Histone Lysine Demethylase Inhibition by Diverse Compounds. Cell Chem Biol23:769-81 (2016) 
 
Lysine-specific demethylase 5B [1-755]
Name:Lysine-specific demethylase 5B [1-755]
Type:Protein
Mol. Mass.:86559.22
Organism:Homo sapiens (Human)
Description:Truncation 1-755 aa. Contains deletion of ARID and PhD1 domains.
Residue:755
BDBM191603
NameBDBM191603
Synonyms:methyl 4'-(phenethylcarbamoyl)-[2,2'-bipyridine]-4-carboxylate (N4)
TypeSmall organic molecule
Emp. Form.C21H19N3O3
Mol. Mass.361.3939
SMILESCOC(=O)c1ccnc(c1)-c1cc(ccn1)C(=O)NCCc1ccccc1