Reaction Details
TargetLysine-specific demethylase 5C [1-789]
LigandBDBM191601
Substrate/Competitorn/a
Meas. Tech.Formaldehyde Dehydrogenase-Coupled Demethylase (FDH) Assay
Temperature298.15±n/a K
IC50 1.0e+4± 2e+3 nM
Commentsextracted
Citation Horton, JRLiu, XGale, MWu, LShanks, JRZhang, XWebber, PJBell, JSKales, SCMott, BTRai, GJansen, DJHenderson, MJUrban, DJHall, MDSimeonov, AMaloney, DJJohns, MAFu, HJadhav, AVertino, PMYan, QCheng, X Structural Basis for KDM5A Histone Lysine Demethylase Inhibition by Diverse Compounds. Cell Chem Biol23:769-81 (2016) 
 
Lysine-specific demethylase 5C [1-789]
Name:Lysine-specific demethylase 5C [1-789]
Type:Protein
Mol. Mass.:90972.72
Organism:Homo sapiens (Human)
Description:Truncation 1-789 aa. Contains deletion of ARID and PhD1 domains.
Residue:789
BDBM191601
NameBDBM191601
Synonyms:3-(2-(4-chlorophenyl)acetamido)isonicotinic acid (N16)
TypeSmall organic molecule
Emp. Form.C14H11ClN2O3
Mol. Mass.290.702
SMILESOC(=O)c1ccncc1NC(=O)Cc1ccc(Cl)cc1