Reaction Details
TargetLysine-specific demethylase 5C [1-789]
LigandBDBM191603
Substrate/Competitorn/a
Meas. Tech.Formaldehyde Dehydrogenase-Coupled Demethylase (FDH) Assay
Temperature298.15±n/a K
IC50>4.50e+5± 6e+3 nM
Commentsextracted
Citation Horton, JRLiu, XGale, MWu, LShanks, JRZhang, XWebber, PJBell, JSKales, SCMott, BTRai, GJansen, DJHenderson, MJUrban, DJHall, MDSimeonov, AMaloney, DJJohns, MAFu, HJadhav, AVertino, PMYan, QCheng, X Structural Basis for KDM5A Histone Lysine Demethylase Inhibition by Diverse Compounds. Cell Chem Biol23:769-81 (2016) 
 
Lysine-specific demethylase 5C [1-789]
Name:Lysine-specific demethylase 5C [1-789]
Type:Protein
Mol. Mass.:90972.72
Organism:Homo sapiens (Human)
Description:Truncation 1-789 aa. Contains deletion of ARID and PhD1 domains.
Residue:789
BDBM191603
NameBDBM191603
Synonyms:methyl 4'-(phenethylcarbamoyl)-[2,2'-bipyridine]-4-carboxylate (N4)
TypeSmall organic molecule
Emp. Form.C21H19N3O3
Mol. Mass.361.3939
SMILESCOC(=O)c1ccnc(c1)-c1cc(ccn1)C(=O)NCCc1ccccc1