Reaction Details
TargetAdenosine receptor A1
LigandBDBM191778
Substrate/Competitorn/a
Meas. Tech.Luciferase Assay
pH7.4±n/a
Temperature310.15±n/a K
EC50 0.06±n/a nM
Commentsextracted
Citation Vakalopoulos, AMeibom, DNell, PSussmeier, FAlbrecht-Kupper, BZimmermann, KKeldenich, JSchneider, DKrenz, U Substituted dicyanopyridines and use thereof US Patent US9187428 Publication Date 11/17/2015
 
Adenosine receptor A1
Name:Adenosine receptor A1
Type:G Protein-Coupled Receptor (GPCR)
Mol. Mass.:36520.92
Organism:Homo sapiens (Human)
Description:P30542
Residue:326
BDBM191778
NameBDBM191778
Synonyms:US9187428, 6
TypeSmall organic molecule
Emp. Form.C23H18N6O3S
Mol. Mass.458.492
SMILESCNC(=O)c1cc(CSc2nc(N)c(C#N)c(-c3ccc4OCCOc4c3)c2C#N)ccn1