Reaction Details
TargetAdenosine receptor A1
LigandBDBM191785
Substrate/Competitorn/a
Meas. Tech.Luciferase Assay
pH7.4±n/a
Temperature310.15±n/a K
EC50 0.08±n/a nM
Commentsextracted
Citation Vakalopoulos, AMeibom, DNell, PSussmeier, FAlbrecht-Kupper, BZimmermann, KKeldenich, JSchneider, DKrenz, U Substituted dicyanopyridines and use thereof US Patent US9187428 Publication Date 11/17/2015
 
Adenosine receptor A1
Name:Adenosine receptor A1
Type:G Protein-Coupled Receptor (GPCR)
Mol. Mass.:36520.92
Organism:Homo sapiens (Human)
Description:P30542
Residue:326
BDBM191785
NameBDBM191785
Synonyms:US9187428, 13
TypeSmall organic molecule
Emp. Form.C23H18N6OS
Mol. Mass.426.494
SMILESNc1nc(SCc2ccnc(c2)C(=O)NC2CC2)c(C#N)c(-c2ccccc2)c1C#N