Reaction Details
TargetAdenosine receptor A1
LigandBDBM191801
Substrate/Competitorn/a
Meas. Tech.Luciferase Assay
pH7.4±n/a
Temperature310.15±n/a K
EC50 0.5±n/a nM
Commentsextracted
Citation Vakalopoulos, AMeibom, DNell, PSussmeier, FAlbrecht-Kupper, BZimmermann, KKeldenich, JSchneider, DKrenz, U Substituted dicyanopyridines and use thereof US Patent US9187428 Publication Date 11/17/2015
 
Adenosine receptor A1
Name:Adenosine receptor A1
Type:G Protein-Coupled Receptor (GPCR)
Mol. Mass.:36520.92
Organism:Homo sapiens (Human)
Description:P30542
Residue:326
BDBM191801
NameBDBM191801
Synonyms:US9187428, 29
TypeSmall organic molecule
Emp. Form.C23H20N6O3S
Mol. Mass.460.508
SMILESCNC(=O)c1cc(CSc2nc(N)c(C#N)c(-c3cccc(OCCO)c3)c2C#N)ccn1