Reaction Details
TargetAdenosine receptor A1
LigandBDBM191810
Substrate/Competitorn/a
Meas. Tech.Luciferase Assay
pH7.4±n/a
Temperature310.15±n/a K
EC50 0.5±n/a nM
Commentsextracted
Citation Vakalopoulos, AMeibom, DNell, PSussmeier, FAlbrecht-Kupper, BZimmermann, KKeldenich, JSchneider, DKrenz, U Substituted dicyanopyridines and use thereof US Patent US9187428 Publication Date 11/17/2015
 
Adenosine receptor A1
Name:Adenosine receptor A1
Type:G Protein-Coupled Receptor (GPCR)
Mol. Mass.:36520.92
Organism:Homo sapiens (Human)
Description:P30542
Residue:326
BDBM191810
NameBDBM191810
Synonyms:US9187428, 38
TypeSmall organic molecule
Emp. Form.C21H15F2N5O2S2
Mol. Mass.471.503
SMILESCS(=O)(=O)Nc1cccc(CSc2nc(N)c(C#N)c(-c3ccc(F)c(F)c3)c2C#N)c1