Reaction Details
TargetAdenosine receptor A1
LigandBDBM191821
Substrate/Competitorn/a
Meas. Tech.Luciferase Assay
pH7.4±n/a
Temperature310.15±n/a K
EC50 0.3±n/a nM
Commentsextracted
Citation Vakalopoulos, AMeibom, DNell, PSussmeier, FAlbrecht-Kupper, BZimmermann, KKeldenich, JSchneider, DKrenz, U Substituted dicyanopyridines and use thereof US Patent US9187428 Publication Date 11/17/2015
 
Adenosine receptor A1
Name:Adenosine receptor A1
Type:G Protein-Coupled Receptor (GPCR)
Mol. Mass.:36520.92
Organism:Homo sapiens (Human)
Description:P30542
Residue:326
BDBM191821
NameBDBM191821
Synonyms:US9187428, 49
TypeSmall organic molecule
Emp. Form.C24H22N6O2S
Mol. Mass.458.535
SMILESCCCOc1cccc(c1)-c1c(C#N)c(N)nc(SCc2ccnc(c2)C(=O)NC)c1C#N