Reaction Details
TargetAdenosine receptor A1
LigandBDBM191822
Substrate/Competitorn/a
Meas. Tech.Luciferase Assay
pH7.4±n/a
Temperature310.15±n/a K
EC50 0.5±n/a nM
Commentsextracted
Citation Vakalopoulos, AMeibom, DNell, PSussmeier, FAlbrecht-Kupper, BZimmermann, KKeldenich, JSchneider, DKrenz, U Substituted dicyanopyridines and use thereof US Patent US9187428 Publication Date 11/17/2015
 
Adenosine receptor A1
Name:Adenosine receptor A1
Type:G Protein-Coupled Receptor (GPCR)
Mol. Mass.:36520.92
Organism:Homo sapiens (Human)
Description:P30542
Residue:326
BDBM191822
NameBDBM191822
Synonyms:US9187428, 50
TypeSmall organic molecule
Emp. Form.C22H14F4N6OS
Mol. Mass.486.445
SMILESCNC(=O)c1cc(CSc2nc(N)c(C#N)c(-c3ccc(F)c(c3)C(F)(F)F)c2C#N)ccn1