Reaction Details
TargetAdenosine receptor A1
LigandBDBM191832
Substrate/Competitorn/a
Meas. Tech.Luciferase Assay
pH7.4±n/a
Temperature310.15±n/a K
EC50 0.4±n/a nM
Commentsextracted
Citation Vakalopoulos, AMeibom, DNell, PSussmeier, FAlbrecht-Kupper, BZimmermann, KKeldenich, JSchneider, DKrenz, U Substituted dicyanopyridines and use thereof US Patent US9187428 Publication Date 11/17/2015
 
Adenosine receptor A1
Name:Adenosine receptor A1
Type:G Protein-Coupled Receptor (GPCR)
Mol. Mass.:36520.92
Organism:Homo sapiens (Human)
Description:P30542
Residue:326
BDBM191832
NameBDBM191832
Synonyms:US9187428, 60
TypeSmall organic molecule
Emp. Form.C24H21N5O3S
Mol. Mass.459.52
SMILESCC(Sc1nc(N)c(C#N)c(-c2ccc(OCCO)cc2)c1C#N)c1cccc(c1)C(N)=O