Reaction Details
TargetAdenosine receptor A1
LigandBDBM191854
Substrate/Competitorn/a
Meas. Tech.Luciferase Assay
pH7.4±n/a
Temperature310.15±n/a K
EC50 0.2±n/a nM
Commentsextracted
Citation Vakalopoulos, AMeibom, DNell, PSussmeier, FAlbrecht-Kupper, BZimmermann, KKeldenich, JSchneider, DKrenz, U Substituted dicyanopyridines and use thereof US Patent US9187428 Publication Date 11/17/2015
 
Adenosine receptor A1
Name:Adenosine receptor A1
Type:G Protein-Coupled Receptor (GPCR)
Mol. Mass.:36520.92
Organism:Homo sapiens (Human)
Description:P30542
Residue:326
BDBM191854
NameBDBM191854
Synonyms:US9187428, 82
TypeSmall organic molecule
Emp. Form.C27H24N6O4S
Mol. Mass.528.582
SMILESCNC(=O)c1cc(CSc2nc(N3CC[C@@H](O)C3)c(C#N)c(-c3ccc4OCCOc4c3)c2C#N)ccn1