Reaction Details
TargetAdenosine receptor A1
LigandBDBM191857
Substrate/Competitorn/a
Meas. Tech.Luciferase Assay
pH7.4±n/a
Temperature310.15±n/a K
EC50 0.5±n/a nM
Commentsextracted
Citation Vakalopoulos, AMeibom, DNell, PSussmeier, FAlbrecht-Kupper, BZimmermann, KKeldenich, JSchneider, DKrenz, U Substituted dicyanopyridines and use thereof US Patent US9187428 Publication Date 11/17/2015
 
Adenosine receptor A1
Name:Adenosine receptor A1
Type:G Protein-Coupled Receptor (GPCR)
Mol. Mass.:36520.92
Organism:Homo sapiens (Human)
Description:P30542
Residue:326
BDBM191857
NameBDBM191857
Synonyms:US9187428, 85
TypeSmall organic molecule
Emp. Form.C27H24N6OS
Mol. Mass.480.584
SMILESO=C(NC1CC1)c1cc(CSc2nc(N3CCCC3)c(C#N)c(-c3ccccc3)c2C#N)ccn1