Reaction Details
TargetAdenosine receptor A1
LigandBDBM191866
Substrate/Competitorn/a
Meas. Tech.Luciferase Assay
pH7.4±n/a
Temperature310.15±n/a K
EC50 0.2±n/a nM
Commentsextracted
Citation Vakalopoulos, AMeibom, DNell, PSussmeier, FAlbrecht-Kupper, BZimmermann, KKeldenich, JSchneider, DKrenz, U Substituted dicyanopyridines and use thereof US Patent US9187428 Publication Date 11/17/2015
 
Adenosine receptor A1
Name:Adenosine receptor A1
Type:G Protein-Coupled Receptor (GPCR)
Mol. Mass.:36520.92
Organism:Homo sapiens (Human)
Description:P30542
Residue:326
BDBM191866
NameBDBM191866
Synonyms:US9187428, 94
TypeSmall organic molecule
Emp. Form.C28H27N5O4S
Mol. Mass.529.61
SMILESCNC(=O)c1cccc(CSc2nc(N3CC[C@@H](O)C3)c(C#N)c(-c3ccc(OCCO)cc3)c2C#N)c1