Reaction Details
TargetAdenosine receptor A1
LigandBDBM191868
Substrate/Competitorn/a
Meas. Tech.Luciferase Assay
pH7.4±n/a
Temperature310.15±n/a K
EC50 0.4±n/a nM
Commentsextracted
Citation Vakalopoulos, AMeibom, DNell, PSussmeier, FAlbrecht-Kupper, BZimmermann, KKeldenich, JSchneider, DKrenz, U Substituted dicyanopyridines and use thereof US Patent US9187428 Publication Date 11/17/2015
 
Adenosine receptor A1
Name:Adenosine receptor A1
Type:G Protein-Coupled Receptor (GPCR)
Mol. Mass.:36520.92
Organism:Homo sapiens (Human)
Description:P30542
Residue:326
BDBM191868
NameBDBM191868
Synonyms:US9187428, 96
TypeSmall organic molecule
Emp. Form.C24H20FN5O3S
Mol. Mass.477.511
SMILESNc1nc(SCc2cccc(c2)C(=O)NC[C@@H](O)CO)c(C#N)c(-c2ccc(F)cc2)c1C#N