Reaction Details
TargetAdenosine receptor A1
LigandBDBM191870
Substrate/Competitorn/a
Meas. Tech.Luciferase Assay
pH7.4±n/a
Temperature310.15±n/a K
EC50 0.3±n/a nM
Commentsextracted
Citation Vakalopoulos, AMeibom, DNell, PSussmeier, FAlbrecht-Kupper, BZimmermann, KKeldenich, JSchneider, DKrenz, U Substituted dicyanopyridines and use thereof US Patent US9187428 Publication Date 11/17/2015
 
Adenosine receptor A1
Name:Adenosine receptor A1
Type:G Protein-Coupled Receptor (GPCR)
Mol. Mass.:36520.92
Organism:Homo sapiens (Human)
Description:P30542
Residue:326
BDBM191870
NameBDBM191870
Synonyms:US9187428, 98
TypeSmall organic molecule
Emp. Form.C29H29N5O3S
Mol. Mass.527.637
SMILESCCNC(=O)c1cccc(CSc2nc(N3CCCC3)c(C#N)c(-c3ccc(OCCO)cc3)c2C#N)c1