Reaction Details
TargetAdenosine receptor A1
LigandBDBM191873
Substrate/Competitorn/a
Meas. Tech.Luciferase Assay
pH7.4±n/a
Temperature310.15±n/a K
EC50 0.2±n/a nM
Commentsextracted
Citation Vakalopoulos, AMeibom, DNell, PSussmeier, FAlbrecht-Kupper, BZimmermann, KKeldenich, JSchneider, DKrenz, U Substituted dicyanopyridines and use thereof US Patent US9187428 Publication Date 11/17/2015
 
Adenosine receptor A1
Name:Adenosine receptor A1
Type:G Protein-Coupled Receptor (GPCR)
Mol. Mass.:36520.92
Organism:Homo sapiens (Human)
Description:P30542
Residue:326
BDBM191873
NameBDBM191873
Synonyms:US9187428, 101
TypeSmall organic molecule
Emp. Form.C23H20N6OS
Mol. Mass.428.51
SMILESNCCNC(=O)c1cccc(CSc2nc(N)c(C#N)c(-c3ccccc3)c2C#N)c1