Reaction Details
TargetAdenosine receptor A2b
LigandBDBM191787
Substrate/Competitorn/a
Meas. Tech.Luciferase Assay
pH7.4±n/a
Temperature310.15±n/a K
EC50 106±n/a nM
Commentsextracted
Citation Vakalopoulos, AMeibom, DNell, PSussmeier, FAlbrecht-Kupper, BZimmermann, KKeldenich, JSchneider, DKrenz, U Substituted dicyanopyridines and use thereof US Patent US9187428 Publication Date 11/17/2015
 
Adenosine receptor A2b
Name:Adenosine receptor A2b
Type:G Protein-Coupled Receptor (GPCR)
Mol. Mass.:36341.22
Organism:Homo sapiens (Human)
Description:n/a
Residue:332
BDBM191787
NameBDBM191787
Synonyms:US9187428, 15
TypeSmall organic molecule
Emp. Form.C21H13N3O2S
Mol. Mass.371.412
SMILESOC(=O)c1cccc(CSc2ncc(C#N)c(-c3ccccc3)c2C#N)c1